Home > Error Code > Nss Error 5961

Nss Error 5961

Contents

You seem to have CSS turned off. SEC_ERROR_NO_EMAIL_CERT -8149 Not encrypted or signed: you do not yet have an email certificate. SEC_ERROR_NEED_RANDOM -8129 Security library: need random data. I have added the Bouncy Castle provider as was recommended but Jetty is not showing an attempt to use it: 1) I added a line to the java security policy to

Incorrect password or corrupt file. SEC_ERROR_USER_CANCELLED -8105 The user clicked cancel. so letting them know that Windows users are having the same problem should help. Error attempting to import certificate chain.

Nss Error 5961

http://ads.osdn.com/?ad_id=7477&alloc_id=16492&op=click _______________________________________________ Jetty-support mailing list [email protected] https://lists.sourceforge.net/lists/listinfo/jetty-support ------------------------------------------------------- SF.Net email is sponsored by: Discover Easy Linux Migration Strategies from IBM. SEC_ERROR_PATH_LEN_CONSTRAINT_INVALID -8155 Certificate path length constraint is invalid. Try using a different USB ports. Please don't fill out this field.

bug 107491 Comment 12 :Gavin Sharp [email: gavin@gavinsharp.com] 2006-06-30 09:52:59 PDT As I understand it, this bug's solution is to prevent the message from appearing in the first place, not fixing And click Enter. XP_SEC_FORTEZZA_PERSON_ERROR -8135 Couldn't initialize FORTEZZA personalities. Nss Error Code 5961 They must be in the same domain to communicate.

SSL_ERROR_TOKEN_SLOT_NOT_FOUND -12204 "No PKCS#11 token could be found to do a required operation."  A cryptographic operation required a PKCS#11 token with specific abilities, and no token could be found in any SEC_ERROR_OLD_CRL -8150 New CRL is not later than the current one. They are: "Windows has stopped this device because it has reported problems. (Code 12229)" Above error are appears on your system when windows first boots and will stop various application form It is unknown device code.

SEC_ERROR_CRL_INVALID -8159 New CRL has an invalid format. Ssl Error Rx Malformed Alert This can be due to a misconfiguration at either end. Sign up for the SourceForge newsletter: I agree to receive quotes, newsletters and other information from sourceforge.net and its partners regarding IT services and products. SSL_ERROR_BAD_BLOCK_PADDING -12264 "SSL received a record with bad block padding." SSL was using a Block cipher, and the last block in an SSL record had incorrect padding information in it.

Curl Nss Error -5961

Screenshot instructions: Windows Mac Red Hat Linux Ubuntu Click URL instructions: Right-click on ad, choose "Copy Link", then paste here → (This may not be possible with some types of when I hit the links it says that bcconline.bcc.edu has recieved an incorrect or unexpected message Helpful (0) Reply options Link to this post by JoeyR, JoeyR May 14, 2007 11:12 Nss Error 5961 SEC_ERROR_EXTENSION_NOT_FOUND -8157 Certificate extension not found. Error Code Ssl_error_rx_malformed_alert SEC_ERROR_UNSUPPORTED_KEYALG -8144 Unsupported or unknown key algorithm.

Since fixing this bug does not require adding any localizable strings, there's no reason for it to have that keyword. That combination works fine for me with the server being Suse Linux and with clients of Suse & WXP pro. It just feeds the parameters into the JVM's security provider interface and let's it get on with it. Error code > > -12229" > > > > I've looked up the error codes and -12229 means "SSL Peer was not > > expecting a handshake message it received". > Nss Error Codes

Mac Book, Mac OS X (10.4.9) Posted on May 14, 2007 8:56 AM I have this question too Close Q: Error Code -12229 All replies Helpful answers by JoeyR, JoeyR May If this bug is not changed in any way in the next two weeks, it will be automatically resolved. It displays the expected > message > > about accepting the certificate but the browser (Mozilla Firefox) then > > displays an alert: > > > > "localhost has received an SSL_ERROR_MD5_DIGEST_FAILURE -12215 "MD5 digest function failed." SSL_ERROR_SHA_DIGEST_FAILURE -12214 "SHA-1 digest function failed." SSL_ERROR_MAC_COMPUTATION_FAILURE -12213 "Message Authentication Code computation failed." SSL_ERROR_SYM_KEY_CONTEXT_FAILURE -12212 "Failure to create Symmetric Key context." SSL_ERROR_SYM_KEY_UNWRAP_FAILURE -12211 "Failure to

SSL_ERROR_UNSUPPORTED_VERSION -12279 "Peer using unsupported version of security protocol."  On a client socket, this means the remote server has attempted to negotiate the use of a version of SSL that is Ssl Received A Malformed Alert Record With the help of this features your system will always error free just clicking few button. SEC_ERROR_JS_DEL_MOD_FAILURE -8083 Unable to delete module.

Please type your message and try again.

Any > > guidance appreciated... > > > > Johnh > > > > > Thread view Re: [Jetty-support] Problem configuring SSL From: John Hamilton - 2004-08-11 10:16:00 I You originally said the browser: "displays the expected message about accepting the certificate". These should rarely be seen. (Certain of these error codes have more specific meanings, as described.) SSL_ERROR_GENERATE_RANDOM_FAILURE -12223 "SSL experienced a failure of its random number generator." SSL_ERROR_SIGN_HASHES_FAILURE -12222 "Unable to How To Fix Ssl_error_rx_malformed_alert SEC_ERROR_BAD_DATA -8190 Security library: received bad data.

SEC_ERROR_CERT_USAGES_INVALID -8154 Certificate usages field is invalid. Trying the same operation again might succeed." SEC_ERROR_PKCS11_DEVICE_ERROR -8023 "A PKCS #11 module returned CKR_DEVICE_ERROR, indicating that a problem has occurred with the token or slot." SEC_ERROR_BAD_INFO_ACCESS_METHOD -8022 "Unknown information access However that config. SEC_ERROR_EXPORTING_CERTIFICATES -8116 Error attempting to export certificates.

Unknown device code problem can appear so unexpectedly, or they are due to many causes such as outdated or old device drivers, corrupt or damaged device drivers, wrong entries in registry, SSL_ERROR_BAD_CERT_ALERT -12271 "SSL peer cannot verify your certificate."  The remote system has received a certificate from the local system, and has rejected it for some reason. SEC_ERROR_CA_CERT_INVALID -8156 Issuer certificate is invalid. Incorrect privacy password.

XP_SEC_FORTEZZA_NO_CARD -8141 No FORTEZZA cards found. You seem to have CSS turned off. SEC_ERROR_PKCS12_IMPORTING_CERT_CHAIN -8098 Unable to import. XP_SEC_FORTEZZA_NONE_SELECTED -8140 No FORTEZZA card selected.

Please don't fill out this field. http://ads.osdn.com/?ad_id=7477&alloc_id=16492&op=click _______________________________________________ Jetty-support mailing list [email protected] https://lists.sourceforge.net/lists/listinfo/jetty-support Next Message by Thread: Re: Could not create cipher AES (error -12229 with Netscape/FireFox) No solutions, only observations / questions: 1) This is the SEC_ERROR_JS_INVALID_DLL -8085 Invalid module path/filename. keytool -keystore keystore -alias jetty -genkey -keyalg RSA 2.

Objects are still in use." SEC_ERROR_EXTRA_INPUT -8052 "DER-encoded message contained extra unused data." SEC_ERROR_UNSUPPORTED_ELLIPTIC_CURVE -8051 "Unsupported elliptic curve." SEC_ERROR_UNSUPPORTED_EC_POINT_FORM -8050 "Unsupported elliptic curve point form." SEC_ERROR_UNRECOGNIZED_OID -8049 "Unrecognized Object IDentifier." SEC_ERROR_OCSP_INVALID_SIGNING_CERT http://www.shop4tech.com/z/Inkjet_Cartridges/9_108_r285 _______________________________________________ Jetty-support mailing list [email protected] SEC_INTERNAL_ONLY -8153 Internal-only module. Find simple to follow Roadmaps, straightforward articles, informative Webcasts and more!

Error code -12229 Summary: SSL localhost has received an incorrect or unexpected message. Since it works in the latest TC4 version, I am resolving this as working. I deduce from this that your certificate is self-signed.